Reaction Details
TargetLeukotriene A-4 hydrolase
LigandBDBM50441910
Substrate/Competitorn/a
Meas. Tech.ChEMBL_987635 (CHEMBL2439368)
Ki 643±n/a nM
Citation Ali, AREl-Bendary, ERGhaly, MAShehata, IA Novel acetamidothiazole derivatives: synthesis and in vitro anticancer evaluation. Eur J Med Chem69:908-19 (2013) 
 
Leukotriene A-4 hydrolase
Name:Leukotriene A-4 hydrolase
Type:Hydrolase; metalloprotease
Mol. Mass.:69280.41
Organism:Homo sapiens (Human)
Description:Human recombinant LTA4H.
Residue:611
BDBM50441910
NameBDBM50441910
Synonyms:CHEMBL2437293
TypeSmall organic molecule
Emp. Form.C21H22N4OS
Mol. Mass.378.491
SMILESN=c1scc(-c2ccccc2)n1CC(=O)N1CCN(CC1)c1ccccc1