Reaction Details
TargetLeukotriene A-4 hydrolase
LigandBDBM50441918
Substrate/Competitorn/a
Meas. Tech.ChEMBL_987635 (CHEMBL2439368)
Ki 1060±n/a nM
Citation Ali, AREl-Bendary, ERGhaly, MAShehata, IA Novel acetamidothiazole derivatives: synthesis and in vitro anticancer evaluation. Eur J Med Chem69:908-19 (2013) 
 
Leukotriene A-4 hydrolase
Name:Leukotriene A-4 hydrolase
Type:Hydrolase; metalloprotease
Mol. Mass.:69280.41
Organism:Homo sapiens (Human)
Description:Human recombinant LTA4H.
Residue:611
BDBM50441918
NameBDBM50441918
Synonyms:CHEMBL2437302
TypeSmall organic molecule
Emp. Form.C15H16ClN3O2S
Mol. Mass.337.824
SMILESClc1ccc(cc1)-c1csc(=N)n1CC(=O)N1CCOCC1