Reaction Details
TargetThymidylate synthase
LigandBDBM50441910
Substrate/Competitorn/a
Meas. Tech.ChEMBL_987636 (CHEMBL2439369)
Ki 1360±n/a nM
Citation Ali, AREl-Bendary, ERGhaly, MAShehata, IA Novel acetamidothiazole derivatives: synthesis and in vitro anticancer evaluation. Eur J Med Chem69:908-19 (2013) 
 
Thymidylate synthase
Name:Thymidylate synthase
Type:Enzyme
Mol. Mass.:35718.07
Organism:Homo sapiens (Human)
Description:n/a
Residue:313
BDBM50441910
NameBDBM50441910
Synonyms:CHEMBL2437293
TypeSmall organic molecule
Emp. Form.C21H22N4OS
Mol. Mass.378.491
SMILESN=c1scc(-c2ccccc2)n1CC(=O)N1CCN(CC1)c1ccccc1