Reaction Details
TargetThymidylate synthase
LigandBDBM50441913
Substrate/Competitorn/a
Meas. Tech.ChEMBL_987636 (CHEMBL2439369)
Ki 10910±n/a nM
Citation Ali, AREl-Bendary, ERGhaly, MAShehata, IA Novel acetamidothiazole derivatives: synthesis and in vitro anticancer evaluation. Eur J Med Chem69:908-19 (2013) 
 
Thymidylate synthase
Name:Thymidylate synthase
Type:Enzyme
Mol. Mass.:35718.07
Organism:Homo sapiens (Human)
Description:n/a
Residue:313
BDBM50441913
NameBDBM50441913
Synonyms:CHEMBL2437297
TypeSmall organic molecule
Emp. Form.C17H20N4O2S
Mol. Mass.344.431
SMILESCC(=O)N1CCN(CC1)C(=O)Cn1c(csc1=N)-c1ccccc1