Reaction Details
TargetThymidylate synthase
LigandBDBM50441916
Substrate/Competitorn/a
Meas. Tech.ChEMBL_987636 (CHEMBL2439369)
Ki 1140±n/a nM
Citation Ali, AREl-Bendary, ERGhaly, MAShehata, IA Novel acetamidothiazole derivatives: synthesis and in vitro anticancer evaluation. Eur J Med Chem69:908-19 (2013) 
 
Thymidylate synthase
Name:Thymidylate synthase
Type:Enzyme
Mol. Mass.:35718.07
Organism:Homo sapiens (Human)
Description:n/a
Residue:313
BDBM50441916
NameBDBM50441916
Synonyms:CHEMBL2437300
TypeSmall organic molecule
Emp. Form.C16H20N4OS
Mol. Mass.316.421
SMILESCN1CCN(CC1)C(=O)Cn1c(csc1=N)-c1ccccc1