Reaction Details
TargetMitogen-activated protein kinase 1
LigandBDBM50441908
Substrate/Competitorn/a
Meas. Tech.ChEMBL_987639 (CHEMBL2439372)
Ki 2090±n/a nM
Citation Ali, AREl-Bendary, ERGhaly, MAShehata, IA Novel acetamidothiazole derivatives: synthesis and in vitro anticancer evaluation. Eur J Med Chem69:908-19 (2013) 
 
Mitogen-activated protein kinase 1
Name:Mitogen-activated protein kinase 1
Type:Ser/Thr Protein Kinase
Mol. Mass.:41392.76
Organism:Homo sapiens (Human)
Description:P28482
Residue:360
BDBM50441908
NameBDBM50441908
Synonyms:CHEMBL2437291
TypeSmall organic molecule
Emp. Form.C22H24N4OS
Mol. Mass.392.517
SMILESCc1ccc(cc1)-c1csc(=N)n1CC(=O)N1CCN(CC1)c1ccccc1