Reaction Details
TargetMitogen-activated protein kinase 1
LigandBDBM50441914
Substrate/Competitorn/a
Meas. Tech.ChEMBL_987639 (CHEMBL2439372)
Ki 1890±n/a nM
Citation Ali, AREl-Bendary, ERGhaly, MAShehata, IA Novel acetamidothiazole derivatives: synthesis and in vitro anticancer evaluation. Eur J Med Chem69:908-19 (2013) 
 
Mitogen-activated protein kinase 1
Name:Mitogen-activated protein kinase 1
Type:Ser/Thr Protein Kinase
Mol. Mass.:41392.76
Organism:Homo sapiens (Human)
Description:P28482
Residue:360
BDBM50441914
NameBDBM50441914
Synonyms:CHEMBL2437296
TypeSmall organic molecule
Emp. Form.C17H22N4OS
Mol. Mass.330.448
SMILESCN1CCN(CC1)C(=O)Cn1c(csc1=N)-c1ccc(C)cc1