Reaction Details
TargetMitogen-activated protein kinase 1
LigandBDBM50441918
Substrate/Competitorn/a
Meas. Tech.ChEMBL_987639 (CHEMBL2439372)
Ki 9180±n/a nM
Citation Ali, AREl-Bendary, ERGhaly, MAShehata, IA Novel acetamidothiazole derivatives: synthesis and in vitro anticancer evaluation. Eur J Med Chem69:908-19 (2013) 
 
Mitogen-activated protein kinase 1
Name:Mitogen-activated protein kinase 1
Type:Ser/Thr Protein Kinase
Mol. Mass.:41392.76
Organism:Homo sapiens (Human)
Description:P28482
Residue:360
BDBM50441918
NameBDBM50441918
Synonyms:CHEMBL2437302
TypeSmall organic molecule
Emp. Form.C15H16ClN3O2S
Mol. Mass.337.824
SMILESClc1ccc(cc1)-c1csc(=N)n1CC(=O)N1CCOCC1