Reaction Details
TargetMitogen-activated protein kinase 1
LigandBDBM50441919
Substrate/Competitorn/a
Meas. Tech.ChEMBL_987639 (CHEMBL2439372)
Ki 13780±n/a nM
Citation Ali, AREl-Bendary, ERGhaly, MAShehata, IA Novel acetamidothiazole derivatives: synthesis and in vitro anticancer evaluation. Eur J Med Chem69:908-19 (2013) 
 
Mitogen-activated protein kinase 1
Name:Mitogen-activated protein kinase 1
Type:Ser/Thr Protein Kinase
Mol. Mass.:41392.76
Organism:Homo sapiens (Human)
Description:P28482
Residue:360
BDBM50441919
NameBDBM50441919
Synonyms:CHEMBL2437301
TypeSmall organic molecule
Emp. Form.C15H17N3O2S
Mol. Mass.303.379
SMILESN=c1scc(-c2ccccc2)n1CC(=O)N1CCOCC1