Reaction Details
TargetVitamin D3 receptor
LigandBDBM50441911
Substrate/Competitorn/a
Meas. Tech.ChEMBL_987815 (CHEMBL2437763)
Ki 2840±n/a nM
Citation Ali, AREl-Bendary, ERGhaly, MAShehata, IA Novel acetamidothiazole derivatives: synthesis and in vitro anticancer evaluation. Eur J Med Chem69:908-19 (2013) 
 
Vitamin D3 receptor
Name:Vitamin D3 receptor
Type:Protein
Mol. Mass.:48288.72
Organism:Homo sapiens (Human)
Description:P11473
Residue:427
BDBM50441911
NameBDBM50441911
Synonyms:CHEMBL2437294
TypeSmall organic molecule
Emp. Form.C18H22N4O2S
Mol. Mass.358.458
SMILESCC(=O)N1CCN(CC1)C(=O)Cn1c(csc1=N)-c1ccc(C)cc1