Reaction Details
TargetVitamin D3 receptor
LigandBDBM50441917
Substrate/Competitorn/a
Meas. Tech.ChEMBL_987815 (CHEMBL2437763)
Ki 13680±n/a nM
Citation Ali, AREl-Bendary, ERGhaly, MAShehata, IA Novel acetamidothiazole derivatives: synthesis and in vitro anticancer evaluation. Eur J Med Chem69:908-19 (2013) 
 
Vitamin D3 receptor
Name:Vitamin D3 receptor
Type:Protein
Mol. Mass.:48288.72
Organism:Homo sapiens (Human)
Description:P11473
Residue:427
BDBM50441917
NameBDBM50441917
Synonyms:CHEMBL2437299
TypeSmall organic molecule
Emp. Form.C16H19N3O2S
Mol. Mass.317.406
SMILESCc1ccc(cc1)-c1csc(=N)n1CC(=O)N1CCOCC1