Reaction Details
TargetSigma non-opioid intracellular receptor 1
LigandBDBM50441937
Substrate/Competitorn/a
Meas. Tech.ChEMBL_987953 (CHEMBL2438376)
Ki 2435±n/a nM
Citation Abate, CSelivanova, SVMüller, AKrämer, SDSchibli, RMarottoli, RPerrone, RBerardi, FNiso, MAmetamey, SM Development of 3,4-dihydroisoquinolin-1(2H)-one derivatives for the Positron Emission Tomography (PET) imaging ofs2 receptors. Eur J Med Chem69:920-30 (2013) 
 
Sigma non-opioid intracellular receptor 1
Name:Sigma non-opioid intracellular receptor 1
Type:Protein
Mol. Mass.:25307.17
Organism:Cavia porcellus (Guinea pig)
Description:Q60492
Residue:223
BDBM50441937
NameBDBM50441937
Synonyms:CHEMBL2437387
TypeSmall organic molecule
Emp. Form.C24H30N2O4
Mol. Mass.410.506
SMILESCOc1cccc2C(=O)N(CCCN3CCc4cc(OC)c(OC)cc4C3)CCc12