Reaction Details
TargetHistone-lysine N-methyltransferase EHMT2
LigandBDBM50442103
Substrate/Competitorn/a
Meas. Tech.ChEMBL_992786 (CHEMBL2444213)
IC50 110±n/a nM
Citation Liu, FBarsyte-Lovejoy, DLi, FXiong, YKorboukh, VHuang, XPAllali-Hassani, AJanzen, WPRoth, BLFrye, SVArrowsmith, CHBrown, PJVedadi, MJin, J Discovery of an in vivo chemical probe of the lysine methyltransferases G9a and GLP. J Med Chem56:8931-42 (2013) 
 
Histone-lysine N-methyltransferase EHMT2
Name:Histone-lysine N-methyltransferase EHMT2
Type:Enzyme
Mol. Mass.:132339.87
Organism:Homo sapiens (Human)
Description:Q96KQ7
Residue:1210
BDBM50442103
NameBDBM50442103
Synonyms:CHEMBL2441082
TypeSmall organic molecule
Emp. Form.C29H44F2N6O2
Mol. Mass.546.6955
SMILESCOc1cc2c(NC3CCN(CC3)C(C)C)nc(nc2cc1OCCCN1CCCC1)N1CCC(F)(F)CC1