Reaction Details
TargetHistone-lysine N-methyltransferase EHMT2
LigandBDBM50353128
Substrate/Competitorn/a
Meas. Tech.ChEMBL_992786 (CHEMBL2444213)
IC50 81±n/a nM
Citation Liu, FBarsyte-Lovejoy, DLi, FXiong, YKorboukh, VHuang, XPAllali-Hassani, AJanzen, WPRoth, BLFrye, SVArrowsmith, CHBrown, PJVedadi, MJin, J Discovery of an in vivo chemical probe of the lysine methyltransferases G9a and GLP. J Med Chem56:8931-42 (2013) 
 
Histone-lysine N-methyltransferase EHMT2
Name:Histone-lysine N-methyltransferase EHMT2
Type:Enzyme
Mol. Mass.:132339.87
Organism:Homo sapiens (Human)
Description:Q96KQ7
Residue:1210
BDBM50353128
NameBDBM50353128
Synonyms:CHEMBL1231795
TypeSmall organic molecule
Emp. Form.C30H47N5O2
Mol. Mass.509.7265
SMILESCOc1cc2c(NC3CCN(CC3)C(C)C)nc(nc2cc1OCCCN1CCCC1)C1CCCCC1