Reaction Details
TargetTyrosine-protein kinase ITK/TSK
LigandBDBM50442141
Substrate/Competitorn/a
Meas. Tech.ChEMBL_993112 (CHEMBL2446687)
Ki 0.251000±n/a nM
Citation Alder, CMAmbler, MCampbell, AJChampigny, ACDeakin, AMHarling, JDHarris, CALongstaff, TLynn, SMaxwell, ACMooney, CJScullion, CSingh, OMSmith, IESomers, DOTame, CJWayne, GWilson, CWoolven, JM Identification of a Novel and Selective Series of Itk Inhibitors via a Template-Hopping Strategy. ACS Med Chem Lett4:948-52 (2013) 
 
Tyrosine-protein kinase ITK/TSK
Name:Tyrosine-protein kinase ITK/TSK
Type:Protein
Mol. Mass.:71839.20
Organism:Homo sapiens (Human)
Description:Q08881
Residue:620
BDBM50442141
NameBDBM50442141
Synonyms:CHEMBL2441276
TypeSmall organic molecule
Emp. Form.C23H24N6OS
Mol. Mass.432.541
SMILESO[C@H]1CC[C@@H](CC1)Nc1nc(Cc2ccccc2)cc(Nc2nc3cccnc3s2)n1