Reaction Details
TargetEukaryotic translation initiation factor 2-alpha kinase 3
LigandBDBM50442163
Substrate/Competitorn/a
Meas. Tech.ChEMBL_990825 (CHEMBL2444392)
IC50 2.7±n/a nM
Citation Axten, JMRomeril, SPShu, ARalph, JMedina, JRFeng, YLi, WHGrant, SWHeerding, DAMinthorn, EMencken, TGaul, NGoetz, AStanley, THassell, AMGampe, RTAtkins, CKumar, R Discovery of GSK2656157: An Optimized PERK Inhibitor Selected for Preclinical Development. ACS Med Chem Lett4:964-8 (2013) 
 
Eukaryotic translation initiation factor 2-alpha kinase 3
Name:Eukaryotic translation initiation factor 2-alpha kinase 3
Type:Enzyme
Mol. Mass.:125190.66
Organism:Homo sapiens (Human)
Description:Q9NZJ5
Residue:1116
BDBM50442163
NameBDBM50442163
Synonyms:CHEMBL2441346
TypeSmall organic molecule
Emp. Form.C22H22FN7O
Mol. Mass.419.4548
SMILESCc1cc(C)n(CC(=O)N2CCc3c2ccc(-c2cn(C)c4ncnc(N)c24)c3F)n1