Reaction Details
TargeteIF-2-alpha kinase GCN2
LigandBDBM50442166
Substrate/Competitorn/a
Meas. Tech.ChEMBL_993288 (CHEMBL2443945)
IC50 3388±n/a nM
Citation Axten, JMRomeril, SPShu, ARalph, JMedina, JRFeng, YLi, WHGrant, SWHeerding, DAMinthorn, EMencken, TGaul, NGoetz, AStanley, THassell, AMGampe, RTAtkins, CKumar, R Discovery of GSK2656157: An Optimized PERK Inhibitor Selected for Preclinical Development. ACS Med Chem Lett4:964-8 (2013) 
 
eIF-2-alpha kinase GCN2
Name:eIF-2-alpha kinase GCN2
Type:PROTEIN
Mol. Mass.:186899.26
Organism:Homo sapiens (Human)
Description:ChEMBL_1495738
Residue:1649
BDBM50442166
NameBDBM50442166
Synonyms:CHEMBL2441340
TypeSmall organic molecule
Emp. Form.C23H21FN6O
Mol. Mass.416.4508
SMILESCc1cccc(CC(=O)N2CCc3c2ccc(-c2cn(C)c4ncnc(N)c24)c3F)n1