Reaction Details
TargetCytochrome P450 2C8
LigandBDBM50396534
Substrate/Competitorn/a
Meas. Tech.ChEMBL_993293 (CHEMBL2443950)
IC50 890±n/a nM
Citation Axten, JMRomeril, SPShu, ARalph, JMedina, JRFeng, YLi, WHGrant, SWHeerding, DAMinthorn, EMencken, TGaul, NGoetz, AStanley, THassell, AMGampe, RTAtkins, CKumar, R Discovery of GSK2656157: An Optimized PERK Inhibitor Selected for Preclinical Development. ACS Med Chem Lett4:964-8 (2013) 
 
Cytochrome P450 2C8
Name:Cytochrome P450 2C8
Type:Protein
Mol. Mass.:55839.23
Organism:Homo sapiens (Human)
Description:P10632
Residue:490
BDBM50396534
NameBDBM50396534
Synonyms:CHEMBL2171124
TypeSmall organic molecule
Emp. Form.C24H20F3N5O
Mol. Mass.451.4437
SMILESCn1cc(-c2ccc3N(CCc3c2)C(=O)Cc2cccc(c2)C(F)(F)F)c2c(N)ncnc12