Reaction Details
Target2-acylglycerol O-acyltransferase 2
LigandBDBM50442175
Substrate/Competitorn/a
Meas. Tech.ChEMBL_991050 (CHEMBL2446069)
IC50 8.0±n/a nM
Citation Abdel-Magid, AF Fighting Obesity and Metabolic Disorders with MGAT-2 Inhibitors. ACS Med Chem Lett4:898-9 (2013) 
 
2-acylglycerol O-acyltransferase 2
Name:2-acylglycerol O-acyltransferase 2
Type:Enzyme
Mol. Mass.:38210.80
Organism:Homo sapiens (Human)
Description:Q3SYC2
Residue:334
BDBM50442175
NameBDBM50442175
Synonyms:CHEMBL2441597
TypeSmall organic molecule
Emp. Form.C27H23F6N3O4
Mol. Mass.567.4796
SMILESCc1ccc(cc1)C1=C(C(=O)Nc2ccno2)C(=O)N[C@@](C1)(c1ccc(OCCCC(F)(F)F)cc1)C(F)(F)F