Reaction Details
TargetDipeptidyl peptidase 8
LigandBDBM50442199
Substrate/Competitorn/a
Meas. Tech.ChEMBL_991618 (CHEMBL2444440)
Ki 3.9±n/a nM
Citation Devasthale, PWang, YWang, WFevig, JFeng, JWang, AHarrity, TEgan, DMorgan, NCap, MFura, AKlei, HEKish, KWeigelt, CSun, LLevesque, PMoulin, FLi, YXZahler, RKirby, MSHamann, LG Optimization of activity, selectivity, and liability profiles in 5-oxopyrrolopyridine DPP4 inhibitors leading to clinical candidate (Sa)-2-(3-(aminomethyl)-4-(2,4-dichlorophenyl)-2-methyl-5-oxo-5H-pyrrolo[3,4-b]pyridin-6(7H)-yl)-N,N-dimethylacetamide (BMS-767778). J Med Chem56:7343-57 (2013) 
 
Dipeptidyl peptidase 8
Name:Dipeptidyl peptidase 8
Type:Enzyme
Mol. Mass.:103342.62
Organism:Homo sapiens (Human)
Description:Q6V1X1
Residue:898
BDBM50442199
NameBDBM50442199
Synonyms:CHEMBL2441838
TypeSmall organic molecule
Emp. Form.C20H21Cl2N3O2
Mol. Mass.406.306
SMILESCc1[nH]c2cn(C[C@H]3CCCO3)c(=O)c2c(c1CN)-c1ccc(Cl)cc1Cl