Reaction Details
TargetDNA nucleotidylexotransferase
LigandBDBM50442209
Substrate/Competitorn/a
Meas. Tech.ChEMBL_991704 (CHEMBL2445052)
Ki 1700±n/a nM
Citation Costi, RCrucitti, GCPescatori, LMessore, AScipione, LTortorella, SAmoroso, ACrespan, ECampiglia, PMaresca, BPorta, AGranata, INovellino, EGouge, JDelarue, MMaga, GDi Santo, R New nucleotide-competitive non-nucleoside inhibitors of terminal deoxynucleotidyl transferase: discovery, characterization, and crystal structure in complex with the target. J Med Chem56:7431-41 (2013) 
 
DNA nucleotidylexotransferase
Name:DNA nucleotidylexotransferase
Type:PROTEIN
Mol. Mass.:58545.66
Organism:Homo sapiens (Human)
Description:ChEMBL_210231
Residue:509
BDBM50442209
NameBDBM50442209
Synonyms:CHEMBL2441980
TypeSmall organic molecule
Emp. Form.C20H16N2O5
Mol. Mass.364.3514
SMILESCCOC(=O)C(=O)CC(=O)C=Cc1cc(c[nH]1)C(=O)c1ccc(cc1)C#N