Reaction Details
TargetHepatocyte growth factor receptor
LigandBDBM50442258
Substrate/Competitorn/a
Meas. Tech.ChEMBL_992004 (CHEMBL2447159)
IC50 19±n/a nM
Citation Zhang, DZhang, XAi, JZhai, YLiang, ZWang, YChen, YLi, CZhao, FJiang, HGeng, MLuo, CLiu, H Synthesis and biological evaluation of 2-amino-5-aryl-3-benzylthiopyridine scaffold based potent c-Met inhibitors. Bioorg Med Chem21:6804-20 (2013) 
 
Hepatocyte growth factor receptor
Name:Hepatocyte growth factor receptor
Type:Protein
Mol. Mass.:155559.73
Organism:Homo sapiens (Human)
Description:P08581
Residue:1390
BDBM50442258
NameBDBM50442258
Synonyms:CHEMBL2442125
TypeSmall organic molecule
Emp. Form.C21H23Cl2FN6O2S
Mol. Mass.513.416
SMILESCC(NS(=O)(=O)c1cc(cnc1N)-c1cnn(c1)C1CCNCC1)c1c(Cl)ccc(F)c1Cl