Reaction Details
TargetTyrosine-protein kinase receptor TYRO3
LigandBDBM50442259
Substrate/Competitorn/a
Meas. Tech.ChEMBL_991999 (CHEMBL2447154)
IC50>1000±n/a nM
Citation Zhang, DZhang, XAi, JZhai, YLiang, ZWang, YChen, YLi, CZhao, FJiang, HGeng, MLuo, CLiu, H Synthesis and biological evaluation of 2-amino-5-aryl-3-benzylthiopyridine scaffold based potent c-Met inhibitors. Bioorg Med Chem21:6804-20 (2013) 
 
Tyrosine-protein kinase receptor TYRO3
Name:Tyrosine-protein kinase receptor TYRO3
Type:Protein
Mol. Mass.:96894.13
Organism:Homo sapiens (Human)
Description:Q06418
Residue:890
BDBM50442259
NameBDBM50442259
Synonyms:CHEMBL2442124
TypeSmall organic molecule
Emp. Form.C21H22Cl2FN5S
Mol. Mass.466.402
SMILESC[C@@H](Sc1cc(cnc1N)-c1cnn(c1)C1CCNCC1)c1c(Cl)ccc(F)c1Cl