Reaction Details
TargetHepatocyte growth factor receptor
LigandBDBM50442266
Substrate/Competitorn/a
Meas. Tech.ChEMBL_992003 (CHEMBL2447158)
IC50 22±n/a nM
Citation Zhang, DZhang, XAi, JZhai, YLiang, ZWang, YChen, YLi, CZhao, FJiang, HGeng, MLuo, CLiu, H Synthesis and biological evaluation of 2-amino-5-aryl-3-benzylthiopyridine scaffold based potent c-Met inhibitors. Bioorg Med Chem21:6804-20 (2013) 
 
Hepatocyte growth factor receptor
Name:Hepatocyte growth factor receptor
Type:Protein
Mol. Mass.:155559.73
Organism:Homo sapiens (Human)
Description:P08581
Residue:1390
BDBM50442266
NameBDBM50442266
Synonyms:CHEMBL2442118
TypeSmall organic molecule
Emp. Form.C29H31Cl2FN4OS
Mol. Mass.573.552
SMILESCC(Sc1cc(cnc1N)-c1ccc(cc1)C(=O)N1CCC(CC1)N1CCCC1)c1c(Cl)ccc(F)c1Cl