Reaction Details
TargetHepatocyte growth factor receptor
LigandBDBM50442277
Substrate/Competitorn/a
Meas. Tech.ChEMBL_992003 (CHEMBL2447158)
IC50 152±n/a nM
Citation Zhang, DZhang, XAi, JZhai, YLiang, ZWang, YChen, YLi, CZhao, FJiang, HGeng, MLuo, CLiu, H Synthesis and biological evaluation of 2-amino-5-aryl-3-benzylthiopyridine scaffold based potent c-Met inhibitors. Bioorg Med Chem21:6804-20 (2013) 
 
Hepatocyte growth factor receptor
Name:Hepatocyte growth factor receptor
Type:Protein
Mol. Mass.:155559.73
Organism:Homo sapiens (Human)
Description:P08581
Residue:1390
BDBM50442277
NameBDBM50442277
Synonyms:CHEMBL2442135
TypeSmall organic molecule
Emp. Form.C17H13Cl2FN4S
Mol. Mass.395.281
SMILESCC(Sc1cc(cnc1N)-c1cncnc1)c1c(Cl)ccc(F)c1Cl