Reaction Details
TargetHepatocyte growth factor receptor
LigandBDBM50390454
Substrate/Competitorn/a
Meas. Tech.ChEMBL_992003 (CHEMBL2447158)
IC50 280±n/a nM
Citation Zhang, DZhang, XAi, JZhai, YLiang, ZWang, YChen, YLi, CZhao, FJiang, HGeng, MLuo, CLiu, H Synthesis and biological evaluation of 2-amino-5-aryl-3-benzylthiopyridine scaffold based potent c-Met inhibitors. Bioorg Med Chem21:6804-20 (2013) 
 
Hepatocyte growth factor receptor
Name:Hepatocyte growth factor receptor
Type:Protein
Mol. Mass.:155559.73
Organism:Homo sapiens (Human)
Description:P08581
Residue:1390
BDBM50390454
NameBDBM50390454
Synonyms:CHEMBL2071448
TypeSmall organic molecule
Emp. Form.C18H16Cl2FN5O
Mol. Mass.408.257
SMILESCC(NC(=O)c1cc(cnc1N)-c1cnn(C)c1)c1c(Cl)ccc(F)c1Cl