Reaction Details
TargetProstaglandin D2 receptor 2
LigandBDBM50442300
Substrate/Competitorn/a
Meas. Tech.ChEMBL_993380 (CHEMBL2444575)
Ki 147±n/a nM
Citation Sandham, DAArnold, NAschauer, HBala, KBarker, LBrown, LBrown, ZBudd, DCox, BDocx, CDubois, GDuggan, NEngland, KEveratt, BFuregati, MHall, EKalthoff, FKing, ALeblanc, CJManini, JMeingassner, JProfit, RSchmidt, ASimmons, JSohal, BStringer, RThomas, MTurner, KLWalker, CWatson, SJWestwick, JWillis, JWilliams, GWilson, C Discovery and characterization of NVP-QAV680, a potent and selective CRTh2 receptor antagonist suitable for clinical testing in allergic diseases. Bioorg Med Chem21:6582-91 (2013) 
 
Prostaglandin D2 receptor 2
Name:Prostaglandin D2 receptor 2
Type:Enzyme
Mol. Mass.:43295.45
Organism:Homo sapiens (Human)
Description:Q9Y5Y4
Residue:395
BDBM50442300
NameBDBM50442300
Synonyms:CHEMBL2442751
TypeSmall organic molecule
Emp. Form.C17H15N3O4
Mol. Mass.325.3187
SMILESCc1c(CC(O)=O)c2cccnc2n1Cc1ccc(cc1)[N+]([O-])=O