Reaction Details
TargetProstaglandin D2 receptor 2
LigandBDBM50296851
Substrate/Competitorn/a
Meas. Tech.ChEMBL_993379 (CHEMBL2444574)
IC50 565±n/a nM
Citation Sandham, DAArnold, NAschauer, HBala, KBarker, LBrown, LBrown, ZBudd, DCox, BDocx, CDubois, GDuggan, NEngland, KEveratt, BFuregati, MHall, EKalthoff, FKing, ALeblanc, CJManini, JMeingassner, JProfit, RSchmidt, ASimmons, JSohal, BStringer, RThomas, MTurner, KLWalker, CWatson, SJWestwick, JWillis, JWilliams, GWilson, C Discovery and characterization of NVP-QAV680, a potent and selective CRTh2 receptor antagonist suitable for clinical testing in allergic diseases. Bioorg Med Chem21:6582-91 (2013) 
 
Prostaglandin D2 receptor 2
Name:Prostaglandin D2 receptor 2
Type:Enzyme
Mol. Mass.:43295.45
Organism:Homo sapiens (Human)
Description:Q9Y5Y4
Residue:395
BDBM50296851
NameBDBM50296851
Synonyms:2-(1-(4-chlorophenylsulfonyl)-2-methyl-1H-pyrrolo[2,3-b]pyridin-3-yl)acetic acid | CHEMBL561539
TypeSmall organic molecule
Emp. Form.C16H13ClN2O4S
Mol. Mass.364.803
SMILESCc1c(CC(O)=O)c2cccnc2n1S(=O)(=O)c1ccc(Cl)cc1