Reaction Details
TargetTransient receptor potential cation channel subfamily V member 1
LigandBDBM50398494
Substrate/Competitorn/a
Meas. Tech.ChEMBL_991133 (CHEMBL2446589)
Ki 0.20±n/a nM
Citation Ha, THRyu, HKim, SEKim, HSAnn, JTran, PTHoang, VHSon, KCui, MChoi, SBlumberg, PMFrank, RBahrenberg, GSchiene, KChristoph, TFrormann, SLee, J TRPV1 antagonist with high analgesic efficacy: 2-Thio pyridine C-region analogues of 2-(3-fluoro-4-methylsulfonylaminophenyl)propanamides. Bioorg Med Chem21:6657-64 (2013) 
 
Transient receptor potential cation channel subfamily V member 1
Name:Transient receptor potential cation channel subfamily V member 1
Type:Protein
Mol. Mass.:94960.75
Organism:Homo sapiens (Human)
Description:Q8NER1
Residue:839
BDBM50398494
NameBDBM50398494
Synonyms:CHEMBL2177429
TypeSmall organic molecule
Emp. Form.C23H28F4N4O3S
Mol. Mass.516.552
SMILESC[C@H](C(=O)NCc1ccc(nc1N1CCC(C)CC1)C(F)(F)F)c1ccc(NS(C)(=O)=O)c(F)c1