Reaction Details
TargetPotassium voltage-gated channel subfamily KQT member 2
LigandBDBM50143558
Substrate/Competitorn/a
Meas. Tech.ChEMBL_990142 (CHEMBL2444337)
EC50 1300±n/a nM
Citation Wu, YJConway, CMSun, LQMachet, FChen, JChen, PHe, HBourin, CCalandra, VPolino, JLDavis, CDHeman, KGribkoff, VKBoissard, CGKnox, RJThompson, MWFitzpatrick, WWeaver, DHarden, DGNatale, JDworetzky, SIStarrett, JE Discovery of (S,E)-3-(2-fluorophenyl)-N-(1-(3-(pyridin-3-yloxy)phenyl)ethyl)-acrylamide as a potent and efficacious KCNQ2 (Kv7.2) opener for the treatment of neuropathic pain. Bioorg Med Chem Lett23:6188-91 (2013) 
 
Potassium voltage-gated channel subfamily KQT member 2
Name:Potassium voltage-gated channel subfamily KQT member 2
Type:PROTEIN
Mol. Mass.:84494.02
Organism:Mus musculus
Description:ChEMBL_990142
Residue:759
BDBM50143558
NameBDBM50143558
Synonyms:CHEMBL41355 N-(2-amino-4-(4-fluorobenzylamino)-phenyl)carbamic acid ethylester [2-Amino-4-(4-fluoro-benzylamino)-phenyl]-carbamic acid ethyl ester
TypeSmall organic molecule
Emp. Form.C16H18FN3O2
Mol. Mass.303.3314
SMILESCCOC(=O)Nc1ccc(NCc2ccc(F)cc2)cc1N