Reaction Details
TargetSodium/glucose cotransporter 1
LigandBDBM50442478
Substrate/Competitorn/a
Meas. Tech.ChEMBL_990144 (CHEMBL2444339)
EC50>50000±n/a nM
Citation Lin, TSLiw, YWSong, JSHsieh, TCYeh, HWHsu, LCLin, CJWu, SHLiang, PH Synthesis and biological evaluation of novel C-aryl d-glucofuranosides as sodium-dependent glucose co-transporter 2 inhibitors. Bioorg Med Chem21:6282-91 (2013) 
 
Sodium/glucose cotransporter 1
Name:Sodium/glucose cotransporter 1
Type:Protein
Mol. Mass.:73503.78
Organism:Homo sapiens (Human)
Description:P13866
Residue:664
BDBM50442478
NameBDBM50442478
Synonyms:CHEMBL2440376
TypeSmall organic molecule
Emp. Form.C20H23ClO5S
Mol. Mass.410.912
SMILESCSc1ccc(Cc2cc(ccc2Cl)[C@@H]2O[C@H]([C@H](O)CO)[C@H](O)[C@H]2O)cc1