Reaction Details
TargetSodium/glucose cotransporter 2
LigandBDBM50442487
Substrate/Competitorn/a
Meas. Tech.ChEMBL_990145 (CHEMBL2444340)
EC50 620±n/a nM
Citation Lin, TSLiw, YWSong, JSHsieh, TCYeh, HWHsu, LCLin, CJWu, SHLiang, PH Synthesis and biological evaluation of novel C-aryl d-glucofuranosides as sodium-dependent glucose co-transporter 2 inhibitors. Bioorg Med Chem21:6282-91 (2013) 
 
Sodium/glucose cotransporter 2
Name:Sodium/glucose cotransporter 2
Type:Protein
Mol. Mass.:72902.00
Organism:Homo sapiens (Human)
Description:P31639
Residue:672
BDBM50442487
NameBDBM50442487
Synonyms:CHEMBL2440370
TypeSmall organic molecule
Emp. Form.C22H27ClO6
Mol. Mass.422.899
SMILESCCc1ccc(Cc2cc([C@@H]3O[C@H]([C@H](O)CO)[C@H](O)[C@H]3O)c(OC)cc2Cl)cc1