Reaction Details
TargetAldo-keto reductase family 1 member B10
LigandBDBM50442498
Substrate/Competitorn/a
Meas. Tech.ChEMBL_990162 (CHEMBL2444357)
IC50 11±n/a nM
Citation Endo, SHu, DSuyama, MMatsunaga, TSugimoto, KMatsuya, YEl-Kabbani, OKuwata, KHara, AKitade, YToyooka, N Synthesis and structure-activity relationship of 2-phenyliminochromene derivatives as inhibitors for aldo-keto reductase (AKR) 1B10. Bioorg Med Chem21:6378-84 (2013) 
 
Aldo-keto reductase family 1 member B10
Name:Aldo-keto reductase family 1 member B10
Type:Protein
Mol. Mass.:36024.67
Organism:Homo sapiens (Human)
Description:O60218. 1ZUA; 4JII; 4GQ0
Residue:316
BDBM50442498
NameBDBM50442498
Synonyms:CHEMBL2440414
TypeSmall organic molecule
Emp. Form.C23H24N2O4
Mol. Mass.392.4477
SMILESCOc1ccc(cc1)\N=c1/oc2cc(O)ccc2cc1C(=O)NC1CCCCC1