Reaction Details
TargetAldo-keto reductase family 1 member B10
LigandBDBM50442501
Substrate/Competitorn/a
Meas. Tech.ChEMBL_990162 (CHEMBL2444357)
IC50 6.8±n/a nM
Citation Endo, SHu, DSuyama, MMatsunaga, TSugimoto, KMatsuya, YEl-Kabbani, OKuwata, KHara, AKitade, YToyooka, N Synthesis and structure-activity relationship of 2-phenyliminochromene derivatives as inhibitors for aldo-keto reductase (AKR) 1B10. Bioorg Med Chem21:6378-84 (2013) 
 
Aldo-keto reductase family 1 member B10
Name:Aldo-keto reductase family 1 member B10
Type:Protein
Mol. Mass.:36024.67
Organism:Homo sapiens (Human)
Description:O60218. 1ZUA; 4JII; 4GQ0
Residue:316
BDBM50442501
NameBDBM50442501
Synonyms:CHEMBL2440422
TypeSmall organic molecule
Emp. Form.C21H15N3O4
Mol. Mass.373.3615
SMILESOc1ccc(cc1)\N=c1/oc2cc(O)ccc2cc1C(=O)Nc1ccccn1