Reaction Details
TargetMatrix metalloproteinase-14
LigandBDBM50173796
Substrate/Competitorn/a
Meas. Tech.ChEMBL_990167 (CHEMBL2444631)
IC50>100000±n/a nM
Citation Tauro, MLaghezza, ALoiodice, FAgamennone, MCampestre, CTortorella, P Arylamino methylene bisphosphonate derivatives as bone seeking matrix metalloproteinase inhibitors. Bioorg Med Chem21:6456-65 (2013) 
 
Matrix metalloproteinase-14
Name:Matrix metalloproteinase-14
Type:Protein
Mol. Mass.:65900.19
Organism:Homo sapiens (Human)
Description:P50281
Residue:582
BDBM50173796
NameBDBM50173796
Synonyms:CHEMBL450938 | [(3-nitro-phenylamino)-phosphono-methyl]-phosphonic acid
TypeSmall organic molecule
Emp. Form.C7H10N2O8P2
Mol. Mass.312.1104
SMILESOP(O)(=O)C(Nc1cccc(c1)[N+]([O-])=O)P(O)(O)=O