Reaction Details
TargetMatrix metalloproteinase-14
LigandBDBM50442515
Substrate/Competitorn/a
Meas. Tech.ChEMBL_990167 (CHEMBL2444631)
IC50>100000±n/a nM
Citation Tauro, MLaghezza, ALoiodice, FAgamennone, MCampestre, CTortorella, P Arylamino methylene bisphosphonate derivatives as bone seeking matrix metalloproteinase inhibitors. Bioorg Med Chem21:6456-65 (2013) 
 
Matrix metalloproteinase-14
Name:Matrix metalloproteinase-14
Type:Protein
Mol. Mass.:65900.19
Organism:Homo sapiens (Human)
Description:P50281
Residue:582
BDBM50442515
NameBDBM50442515
Synonyms:CHEMBL2440438
TypeSmall organic molecule
Emp. Form.C7H11NO7P2
Mol. Mass.283.1123
SMILESOc1ccc(NC(P(O)(O)=O)P(O)(O)=O)cc1