Reaction Details
TargetNeuropeptide Y receptor type 2
LigandBDBM50423655
Substrate/Competitorn/a
Meas. Tech.ChEMBL_990503 (CHEMBL2446800)
Ki 2.6±n/a nM
Citation Keller, MKaske, MHolzammer, TBernhardt, GBuschauer, A Dimeric argininamide-type neuropeptide Y receptor antagonists: chiral discrimination between Y1 and Y4 receptors. Bioorg Med Chem21:6303-22 (2013) 
 
Neuropeptide Y receptor type 2
Name:Neuropeptide Y receptor type 2
Type:Enzyme Catalytic Domain
Mol. Mass.:42734.65
Organism:Homo sapiens (Human)
Description:NPY-Y2 NPY2R HUMAN::P49146
Residue:381
BDBM50423655
NameBDBM50423655
Synonyms:CHEMBL2307889
TypeSmall organic molecule
Emp. Form.C49H57N11O6
Mol. Mass.896.047
SMILES[#7]\[#6](-[#7])=[#7]\[#6]-[#6]-[#6]-[#6@@H](-[#7]-[#6](=O)-[#6]C1([#6]-[#6](=O)-[#7]-2-[#6]-[#6]-[#7](-[#6]-[#6]-2)-[#6]-2-c3ccccc3-[#7]-[#6](=O)-c3ccccc-23)[#6]-[#6]-[#6]-[#6]1)-[#6](=O)-[#7]-[#6]-[#6]-n1c(=O)n(-c2ccccc2)n(-c2ccccc2)c1=O