Reaction Details
TargetATP-sensitive inward rectifier potassium channel 1
LigandBDBM50442592
Substrate/Competitorn/a
Meas. Tech.ChEMBL_990661 (CHEMBL2443483)
IC50 550±n/a nM
Citation Tang, Hde Jesus, RKWalsh, SPZhu, YYan, YPriest, BTSwensen, AMAlonso-Galicia, MFelix, JPBrochu, RMBailey, TThomas-Fowlkes, BZhou, XPai, LYHampton, CHernandez, MOwens, KRoy, SKaczorowski, GJYang, LGarcia, MLPasternak, A Discovery of a novel sub-class of ROMK channel inhibitors typified by 5-(2-(4-(2-(4-(1H-Tetrazol-1-yl)phenyl)acetyl)piperazin-1-yl)ethyl)isobenzofuran-1(3H)-one. Bioorg Med Chem Lett23:5829-32 (2013) 
 
ATP-sensitive inward rectifier potassium channel 1
Name:ATP-sensitive inward rectifier potassium channel 1
Type:Enzyme Catalytic Domain
Mol. Mass.:44809.08
Organism:Homo sapiens (Human)
Description:gi_223460826
Residue:391
BDBM50442592
NameBDBM50442592
Synonyms:CHEMBL2441411
TypeSmall organic molecule
Emp. Form.C24H23N7O3
Mol. Mass.457.4845
SMILESO=C(Cc1ccc(c(c1)C#N)-n1cnnn1)N1CCN(CCc2ccc3C(=O)OCc3c2)CC1