Reaction Details
TargetATP-sensitive inward rectifier potassium channel 1
LigandBDBM50442607
Substrate/Competitorn/a
Meas. Tech.ChEMBL_990661 (CHEMBL2443483)
IC50 2100±n/a nM
Citation Tang, Hde Jesus, RKWalsh, SPZhu, YYan, YPriest, BTSwensen, AMAlonso-Galicia, MFelix, JPBrochu, RMBailey, TThomas-Fowlkes, BZhou, XPai, LYHampton, CHernandez, MOwens, KRoy, SKaczorowski, GJYang, LGarcia, MLPasternak, A Discovery of a novel sub-class of ROMK channel inhibitors typified by 5-(2-(4-(2-(4-(1H-Tetrazol-1-yl)phenyl)acetyl)piperazin-1-yl)ethyl)isobenzofuran-1(3H)-one. Bioorg Med Chem Lett23:5829-32 (2013) 
 
ATP-sensitive inward rectifier potassium channel 1
Name:ATP-sensitive inward rectifier potassium channel 1
Type:Enzyme Catalytic Domain
Mol. Mass.:44809.08
Organism:Homo sapiens (Human)
Description:gi_223460826
Residue:391
BDBM50442607
NameBDBM50442607
Synonyms:CHEMBL2441429
TypeSmall organic molecule
Emp. Form.C21H25N7O2
Mol. Mass.407.4689
SMILES[O-][N+](=O)c1ccc(CCN2CCN(CCc3ccc(cc3)-n3cnnn3)CC2)cc1