Reaction Details
TargetATP-sensitive inward rectifier potassium channel 1
LigandBDBM50442595
Substrate/Competitorn/a
Meas. Tech.ChEMBL_990647 (CHEMBL2447658)
IC50 199±n/a nM
Citation Tang, Hde Jesus, RKWalsh, SPZhu, YYan, YPriest, BTSwensen, AMAlonso-Galicia, MFelix, JPBrochu, RMBailey, TThomas-Fowlkes, BZhou, XPai, LYHampton, CHernandez, MOwens, KRoy, SKaczorowski, GJYang, LGarcia, MLPasternak, A Discovery of a novel sub-class of ROMK channel inhibitors typified by 5-(2-(4-(2-(4-(1H-Tetrazol-1-yl)phenyl)acetyl)piperazin-1-yl)ethyl)isobenzofuran-1(3H)-one. Bioorg Med Chem Lett23:5829-32 (2013) 
 
ATP-sensitive inward rectifier potassium channel 1
Name:ATP-sensitive inward rectifier potassium channel 1
Type:Enzyme
Mol. Mass.:44976.27
Organism:Rattus norvegicus (Rat)
Description:P35560
Residue:391
BDBM50442595
NameBDBM50442595
Synonyms:CHEMBL2441408 | US9056859, 12
TypeSmall organic molecule
Emp. Form.C24H26N6O3
Mol. Mass.446.5016
SMILESO=C(Cc1ccc(cc1)-n1cnnn1)N1CCN(CCc2ccc3C(=O)OCCc3c2)CC1