Reaction Details
TargetATP-sensitive inward rectifier potassium channel 1
LigandBDBM50442617
Substrate/Competitorn/a
Meas. Tech.ChEMBL_990661 (CHEMBL2443483)
IC50 250±n/a nM
Citation Tang, Hde Jesus, RKWalsh, SPZhu, YYan, YPriest, BTSwensen, AMAlonso-Galicia, MFelix, JPBrochu, RMBailey, TThomas-Fowlkes, BZhou, XPai, LYHampton, CHernandez, MOwens, KRoy, SKaczorowski, GJYang, LGarcia, MLPasternak, A Discovery of a novel sub-class of ROMK channel inhibitors typified by 5-(2-(4-(2-(4-(1H-Tetrazol-1-yl)phenyl)acetyl)piperazin-1-yl)ethyl)isobenzofuran-1(3H)-one. Bioorg Med Chem Lett23:5829-32 (2013) 
 
ATP-sensitive inward rectifier potassium channel 1
Name:ATP-sensitive inward rectifier potassium channel 1
Type:Enzyme Catalytic Domain
Mol. Mass.:44809.08
Organism:Homo sapiens (Human)
Description:gi_223460826
Residue:391
BDBM50442617
NameBDBM50442617
Synonyms:CHEMBL2441421
TypeSmall organic molecule
Emp. Form.C23H23ClN6O3
Mol. Mass.466.92
SMILESClc1c2COC(=O)c2ccc1CCN1CCN(CC1)C(=O)Cc1ccc(cc1)-n1cnnn1