Reaction Details
TargetHistamine receptor H3
LigandBDBM50442630
Substrate/Competitorn/a
Meas. Tech.ChEMBL_990753 (CHEMBL2443820)
Ki 0.390000±n/a nM
Citation Gao, ZHurst, WJCzechtizky, WFrancon, DGriebel, GNagorny, RPichat, PSchwink, LStengelin, SHendrix, JAGeorge, PG Discovery of a potent, selective, and orally bioavailable histamine H3 receptor antagonist SAR110068 for the treatment of sleep-wake disorders. Bioorg Med Chem Lett23:6141-5 (2013) 
 
Histamine receptor H3
Name:Histamine receptor H3
Synonyms:n/a
Type:Enzyme
Mol. Mass.:48611.84
Organism:Macaca mulatta (Rhesus macaque)
Description:Q865E1
Residue:445
BDBM50442630
NameBDBM50442630
Synonyms:CHEMBL2441638
TypeSmall organic molecule
Emp. Form.C23H35N3O
Mol. Mass.369.5435
SMILESC[C@H]1CCCN1[C@H]1CCN(C1)c1ccc(NC(=O)C2CCCCC2)c(C)c1