Reaction Details
TargetSerine/threonine-protein kinase pim-1
LigandBDBM50442673
Substrate/Competitorn/a
Meas. Tech.ChEMBL_989150 (CHEMBL2446213)
IC50 1.3±n/a nM
Citation Dwyer, MPKeertikar, KParuch, KAlvarez, CLabroli, MPoker, CFischmann, TOMayer-Ezell, RBond, RWang, YAzevedo, RGuzi, TJ Discovery of pyrazolo[1,5-a]pyrimidine-based Pim inhibitors: a template-based approach. Bioorg Med Chem Lett23:6178-82 (2013) 
 
Serine/threonine-protein kinase pim-1
Name:Serine/threonine-protein kinase pim-1
Type:Protein
Mol. Mass.:35681.82
Organism:Homo sapiens (Human)
Description:P11309
Residue:313
BDBM50442673
NameBDBM50442673
Synonyms:CHEMBL2442291
TypeSmall organic molecule
Emp. Form.C17H17N7O
Mol. Mass.335.3632
SMILESCc1nnc(o1)-c1cccc(c1)-c1cnn2ccc(NCCN)nc12