Reaction Details
TargetMonocarboxylate transporter 4
LigandBDBM50442717
Substrate/Competitorn/a
Meas. Tech.ChEMBL_989589 (CHEMBL2444904)
IC50 1250±n/a nM
Citation Draoui, NSchicke, OFernandes, ADrozak, XNahra, FDumont, ADouxfils, JHermans, EDogné, JMCorbau, RMarchand, AChaltin, PSonveaux, PFeron, ORiant, O Synthesis and pharmacological evaluation of carboxycoumarins as a new antitumor treatment targeting lactate transport in cancer cells. Bioorg Med Chem21:7107-17 (2013) 
 
Monocarboxylate transporter 4
Name:Monocarboxylate transporter 4
Type:PROTEIN
Mol. Mass.:49474.36
Organism:Homo sapiens (Human)
Description:ChEMBL_104604
Residue:465
BDBM50442717
NameBDBM50442717
Synonyms:CHEMBL2442515
TypeSmall organic molecule
Emp. Form.C17H11FO5
Mol. Mass.314.2646
SMILESOC(=O)c1cc2ccc(OCc3ccc(F)cc3)cc2oc1=O