Reaction Details
TargetHistone deacetylase 3
LigandBDBM50442729
Substrate/Competitorn/a
Meas. Tech.ChEMBL_989767 (CHEMBL2446005)
IC50 590±n/a nM
Citation Zhang, XBao, BYu, XTong, LLuo, YHuang, QSu, MSheng, LLi, JZhu, HYang, BZhang, XChen, YLu, W The discovery and optimization of novel dual inhibitors of topoisomerase II and histone deacetylase. Bioorg Med Chem21:6981-95 (2013) 
 
Histone deacetylase 3
Name:Histone deacetylase 3
Type:Enzyme
Mol. Mass.:48829.55
Organism:Homo sapiens (Human)
Description:O15379
Residue:428
BDBM50442729
NameBDBM50442729
Synonyms:CHEMBL2442789
TypeSmall organic molecule
Emp. Form.C34H37N3O10
Mol. Mass.647.6717
SMILESCOc1cc(cc(OC)c1O)[C@H]1[C@@H]2[C@H](COC2=O)[C@H](Nc2cccc(NC(=O)CCCCCC(=O)NO)c2)c2cc3OCOc3cc12