Reaction Details
TargetMaternal embryonic leucine zipper kinase
LigandBDBM50442759
Substrate/Competitorn/a
Meas. Tech.ChEMBL_989468 (CHEMBL2443995)
IC50>10.0±n/a nM
Citation Brasca, MGMantegani, SAmboldi, NBindi, SCaronni, DCasale, ECeccarelli, WColombo, NDe Ponti, ADonati, DErmoli, AFachin, GFelder, ERFerguson, RDFiorelli, CGuanci, MIsacchi, APesenti, EPolucci, PRiceputi, LSola, FVisco, CZuccotto, FFogliatto, G Discovery of NMS-E973 as novel, selective and potent inhibitor of heat shock protein 90 (Hsp90). Bioorg Med Chem21:7047-63 (2013) 
 
Maternal embryonic leucine zipper kinase
Name:Maternal embryonic leucine zipper kinase
Type:Enzyme
Mol. Mass.:74665.45
Organism:Homo sapiens (Human)
Description:Q14680
Residue:651
BDBM50442759
NameBDBM50442759
Synonyms:CHEMBL2443138
TypeSmall organic molecule
Emp. Form.C24H28N4O5
Mol. Mass.452.5029
SMILESCN(C)c1ccc(Oc2cc(O)cc(O)c2-c2cc(no2)C(=O)NC2CCN(C)CC2)cc1