Reaction Details
TargetCasein kinase II subunit alpha/beta
LigandBDBM50442758
Substrate/Competitorn/a
Meas. Tech.ChEMBL_989485 (CHEMBL2444012)
IC50>10.0±n/a nM
Citation Brasca, MGMantegani, SAmboldi, NBindi, SCaronni, DCasale, ECeccarelli, WColombo, NDe Ponti, ADonati, DErmoli, AFachin, GFelder, ERFerguson, RDFiorelli, CGuanci, MIsacchi, APesenti, EPolucci, PRiceputi, LSola, FVisco, CZuccotto, FFogliatto, G Discovery of NMS-E973 as novel, selective and potent inhibitor of heat shock protein 90 (Hsp90). Bioorg Med Chem21:7047-63 (2013) 
 
Casein kinase II subunit alpha/beta
Name:Casein kinase II subunit alpha/beta
Type:n/a
Mol. Mass.:n/a
Description:ASSAY_ID of ChEMBL is 989485
Components:This complex has 2 components.
Component 1
Name:Casein kinase II subunit alpha
Synonyms:CK II CK2- alpha CSK21_HUMAN Casein kinase 2 Casein kinase II alpha/beta Casein kinase II subunit alpha (CK2A1) Casein kinase II subunit alpha (CK2a V66A) Casein kinase II subunit alpha (CK2a)
Type:Enzyme
Mol. Mass.:45151.12
Organism:Homo sapiens (Human)
Description:P68400
Residue:391
Component 2
Name:Casein kinase II subunit beta
Synonyms:CK II beta Casein kinase II beta Ck2n Phosvitin
Type:PROTEIN
Mol. Mass.:24937.13
Organism:Rattus norvegicus
Description:EBI_10969
Residue:215
BDBM50442758
NameBDBM50442758
Synonyms:CHEMBL2443139
TypeSmall organic molecule
Emp. Form.C25H30N4O5
Mol. Mass.466.5295
SMILESCC(C)Nc1ccc(Oc2cc(O)cc(O)c2-c2cc(no2)C(=O)NC2CCN(C)CC2)cc1