Reaction Details
TargetHigh affinity nerve growth factor receptor
LigandBDBM50442758
Substrate/Competitorn/a
Meas. Tech.ChEMBL_989448 (CHEMBL2443725)
IC50>10.0±n/a nM
Citation Brasca, MGMantegani, SAmboldi, NBindi, SCaronni, DCasale, ECeccarelli, WColombo, NDe Ponti, ADonati, DErmoli, AFachin, GFelder, ERFerguson, RDFiorelli, CGuanci, MIsacchi, APesenti, EPolucci, PRiceputi, LSola, FVisco, CZuccotto, FFogliatto, G Discovery of NMS-E973 as novel, selective and potent inhibitor of heat shock protein 90 (Hsp90). Bioorg Med Chem21:7047-63 (2013) 
 
High affinity nerve growth factor receptor
Name:High affinity nerve growth factor receptor
Type:n/a
Mol. Mass.:87498.18
Organism:Homo sapiens (Human)
Description:P04629
Residue:796
BDBM50442758
NameBDBM50442758
Synonyms:CHEMBL2443139
TypeSmall organic molecule
Emp. Form.C25H30N4O5
Mol. Mass.466.5295
SMILESCC(C)Nc1ccc(Oc2cc(O)cc(O)c2-c2cc(no2)C(=O)NC2CCN(C)CC2)cc1