Reaction Details
TargetPlatelet-derived growth factor receptor beta
LigandBDBM50442760
Substrate/Competitorn/a
Meas. Tech.ChEMBL_989459 (CHEMBL2443986)
IC50>10.0±n/a nM
Citation Brasca, MGMantegani, SAmboldi, NBindi, SCaronni, DCasale, ECeccarelli, WColombo, NDe Ponti, ADonati, DErmoli, AFachin, GFelder, ERFerguson, RDFiorelli, CGuanci, MIsacchi, APesenti, EPolucci, PRiceputi, LSola, FVisco, CZuccotto, FFogliatto, G Discovery of NMS-E973 as novel, selective and potent inhibitor of heat shock protein 90 (Hsp90). Bioorg Med Chem21:7047-63 (2013) 
 
Platelet-derived growth factor receptor beta
Name:Platelet-derived growth factor receptor beta
Type:Enzyme
Mol. Mass.:123922.25
Organism:Homo sapiens (Human)
Description:P09619
Residue:1106
BDBM50442760
NameBDBM50442760
Synonyms:CHEMBL2443044
TypeSmall organic molecule
Emp. Form.C22H22N4O7
Mol. Mass.454.4327
SMILESCN1CCC(CC1)NC(=O)c1cc(on1)-c1c(O)cc(O)cc1Oc1ccc(cc1)[N+]([O-])=O