Reaction Details
TargetCell division cycle 7-related protein kinase
LigandBDBM50442757
Substrate/Competitorn/a
Meas. Tech.ChEMBL_989488 (CHEMBL2444015)
IC50>10.0±n/a nM
Citation Brasca, MGMantegani, SAmboldi, NBindi, SCaronni, DCasale, ECeccarelli, WColombo, NDe Ponti, ADonati, DErmoli, AFachin, GFelder, ERFerguson, RDFiorelli, CGuanci, MIsacchi, APesenti, EPolucci, PRiceputi, LSola, FVisco, CZuccotto, FFogliatto, G Discovery of NMS-E973 as novel, selective and potent inhibitor of heat shock protein 90 (Hsp90). Bioorg Med Chem21:7047-63 (2013) 
 
Cell division cycle 7-related protein kinase
Name:Cell division cycle 7-related protein kinase
Type:Protein
Mol. Mass.:63908.16
Organism:Homo sapiens (Human)
Description:O00311
Residue:574
BDBM50442757
NameBDBM50442757
Synonyms:CHEMBL2443026
TypeSmall organic molecule
Emp. Form.C31H38N4O7
Mol. Mass.578.656
SMILESCN(C)c1ccc(Oc2cc(O)cc(O)c2-c2cc(no2)C(=O)NC2CCN(CC2)C2CCC3(CC2)OCCO3)cc1